Target
Oxysterols receptor LXR-beta
Ligand
BDBM26066
Substrate
Meas. Tech.
ChEMBL_604020 (CHEMBL1049548)
EC50
3670±n/a nM
Citation
 Hu, BBernotas, RUnwalla, RCollini, MQuinet, EFeingold, IGoos-Nilsson, AWilhelmsson, ANambi, PEvans, MWrobel, J Quinoline-3-carboxamide containing sulfones as liver X receptor (LXR) agonists with binding selectivity for LXRbeta and low blood-brain penetration. Bioorg Med Chem Lett 20:689-93 (2010)  
Target
Name:
Oxysterols receptor LXR-beta
Synonyms:
LXRB Liver X, LXR beta NR1H2 Nuclear receptor NER Ubiquitously-expressed nuclear receptor
Type:
Enzyme Catalytic Domain
Mol. Mass.:
50978.79
Organism:
Homo sapiens (Human)
Description:
P55055
Residue:
460
  
Inhibitor
Name:
BDBM26066
Synonyms:
2-[(2-chloro-4-fluorophenyl)methyl]-3-(4-fluorophenyl)-7-(trifluoromethyl)-2H-indazole US10543183, Compound LXR-623 US10945978, Compound 3 | WAY-252623
Type:
Small organic molecule
Emp. Form.:
C21H12ClF5N2
Mol. Mass.:
422.778
SMILES:
Fc1ccc(cc1)-c1n(Cc2ccc(F)cc2Cl)nc2c(cccc12)C(F)(F)F
: