Target
C5a anaphylatoxin chemotactic receptor 1
Ligand
BDBM50305741
Substrate
Meas. Tech.
ChEMBL_604749 (CHEMBL1072543)
IC50
>60000±n/a nM
Citation
 Chen, JJCole, DCCiszewski, GCrouse, KEllingboe, JWNowak, PTawa, GJBerstein, GLi, W Identification of a new class of small molecule C5a receptor antagonists. Bioorg Med Chem Lett 20:662-4 (2010)  
Target
Name:
C5a anaphylatoxin chemotactic receptor 1
Synonyms:
C5AR C5AR1_HUMAN C5a anaphylatoxin chemotactic receptor C5a-R | CD_antigen=CD88
Type:
Enzyme
Mol. Mass.:
39347.68
Organism:
Homo sapiens (Human)
Description:
P21730
Residue:
350
  
Inhibitor
Name:
BDBM50305741
Synonyms:
1,4-ditosylpiperazine | CHEMBL596080
Type:
Small organic molecule
Emp. Form.:
C18H22N2O4S2
Mol. Mass.:
394.508
SMILES:
Cc1ccc(cc1)S(=O)(=O)N1CCN(CC1)S(=O)(=O)c1ccc(C)cc1
: