Target
C5a anaphylatoxin chemotactic receptor 1
Ligand
BDBM50305742
Substrate
Meas. Tech.
ChEMBL_604749 (CHEMBL1072543)
IC50
>60000±n/a nM
Citation
 Chen, JJCole, DCCiszewski, GCrouse, KEllingboe, JWNowak, PTawa, GJBerstein, GLi, W Identification of a new class of small molecule C5a receptor antagonists. Bioorg Med Chem Lett 20:662-4 (2010)  
Target
Name:
C5a anaphylatoxin chemotactic receptor 1
Synonyms:
C5AR C5AR1_HUMAN C5a anaphylatoxin chemotactic receptor C5a-R | CD_antigen=CD88
Type:
Enzyme
Mol. Mass.:
39347.68
Organism:
Homo sapiens (Human)
Description:
P21730
Residue:
350
  
Inhibitor
Name:
BDBM50305742
Synonyms:
CHEMBL605416 | N,N'-(propane-1,3-diyl)bis(4-methyl-N-phenylbenzenesulfonamide)
Type:
Small organic molecule
Emp. Form.:
C29H30N2O4S2
Mol. Mass.:
534.69
SMILES:
Cc1ccc(cc1)S(=O)(=O)N(CCCN(c1ccccc1)S(=O)(=O)c1ccc(C)cc1)c1ccccc1
: