Target
C5a anaphylatoxin chemotactic receptor 1
Ligand
BDBM50305731
Substrate
Meas. Tech.
ChEMBL_604750 (CHEMBL1072544)
IC50
1700±n/a nM
Citation
 Chen, JJCole, DCCiszewski, GCrouse, KEllingboe, JWNowak, PTawa, GJBerstein, GLi, W Identification of a new class of small molecule C5a receptor antagonists. Bioorg Med Chem Lett 20:662-4 (2010)  
Target
Name:
C5a anaphylatoxin chemotactic receptor 1
Synonyms:
C5AR C5AR1_HUMAN C5a anaphylatoxin chemotactic receptor C5a-R | CD_antigen=CD88
Type:
Enzyme
Mol. Mass.:
39347.68
Organism:
Homo sapiens (Human)
Description:
P21730
Residue:
350
  
Inhibitor
Name:
BDBM50305731
Synonyms:
CHEMBL604583 | N,4-dimethyl-N-(2-(thiophene-3-carbonyl)phenyl)benzenesulfonamide
Type:
Small organic molecule
Emp. Form.:
C19H17NO3S2
Mol. Mass.:
371.473
SMILES:
CN(c1ccccc1C(=O)c1ccsc1)S(=O)(=O)c1ccc(C)cc1
: