Target
Acyl-CoA desaturase 1
Ligand
BDBM50305760
Substrate
Meas. Tech.
ChEMBL_604760 (CHEMBL1072554)
IC50
4±n/a nM
Citation
 Léger, SBlack, WCDeschenes, DDolman, SFalgueyret, JPGagnon, MGuiral, SHuang, ZGuay, JLeblanc, YLi, CSMassé, FOballa, RZhang, L Synthesis and biological activity of a potent and orally bioavailable SCD inhibitor (MF-438). Bioorg Med Chem Lett 20:499-502 (2010)  
Target
Name:
Acyl-CoA desaturase 1
Synonyms:
ACOD1_RAT Scd Stearoyl-CoA desaturase 1 (SCD1)
Type:
Enzyme
Mol. Mass.:
41485.97
Organism:
Rattus norvegicus (Rat)
Description:
P07308
Residue:
358
  
Inhibitor
Name:
BDBM50305760
Synonyms:
3-(1H-imidazol-1-yl)-6-(4-(2-(trifluoromethyl)phenoxy)piperidin-1-yl)pyridazine | CHEMBL595154
Type:
Small organic molecule
Emp. Form.:
C19H18F3N5O
Mol. Mass.:
389.3743
SMILES:
FC(F)(F)c1ccccc1OC1CCN(CC1)c1ccc(nn1)-n1ccnc1
: