Target
Acyl-CoA desaturase 1
Ligand
BDBM50305769
Substrate
Meas. Tech.
ChEMBL_604760 (CHEMBL1072554)
IC50
8.8±n/a nM
Citation
 Léger, SBlack, WCDeschenes, DDolman, SFalgueyret, JPGagnon, MGuiral, SHuang, ZGuay, JLeblanc, YLi, CSMassé, FOballa, RZhang, L Synthesis and biological activity of a potent and orally bioavailable SCD inhibitor (MF-438). Bioorg Med Chem Lett 20:499-502 (2010)  
Target
Name:
Acyl-CoA desaturase 1
Synonyms:
ACOD1_RAT Scd Stearoyl-CoA desaturase 1 (SCD1)
Type:
Enzyme
Mol. Mass.:
41485.97
Organism:
Rattus norvegicus (Rat)
Description:
P07308
Residue:
358
  
Inhibitor
Name:
BDBM50305769
Synonyms:
2-isopropyl-5-(6-(4-(2-(trifluoromethyl)phenoxy)piperidin-1-yl)pyridazin-3-yl)-1,3,4-thiadiazole | CHEMBL594449
Type:
Small organic molecule
Emp. Form.:
C21H22F3N5OS
Mol. Mass.:
449.492
SMILES:
CC(C)c1nnc(s1)-c1ccc(nn1)N1CCC(CC1)Oc1ccccc1C(F)(F)F
: