Target
Collagenase 3
Ligand
BDBM50305832
Substrate
Meas. Tech.
ChEMBL_605223 (CHEMBL1069934)
Ki
37±n/a nM
Citation
 Schnute, MEO'Brien, PMNahra, JMorris, MHoward Roark, WHanau, CERuminski, PGScholten, JAFletcher, TRHamper, BCCarroll, JNPatt, WCShieh, HSCollins, BPavlovsky, AGPalmquist, KEAston, KWHitchcock, JRogers, MDMcDonald, JJohnson, ARMunie, GEWittwer, AJMan, CFSettle, SLNemirovskiy, OVickery, LEAgawal, ADyer, RDSunyer, T Discovery of (pyridin-4-yl)-2H-tetrazole as a novel scaffold to identify highly selective matrix metalloproteinase-13 inhibitors for the treatment of osteoarthritis. Bioorg Med Chem Lett 20:576-80 (2010)  
Target
Name:
Collagenase 3
Synonyms:
MMP-13 MMP13_HUMAN Matrix metalloproteinase-13 (MMP-13) | Matrix metalloproteinase-13 (MMP13)
Type:
Enzyme
Mol. Mass.:
53808.06
Organism:
Homo sapiens (Human)
Description:
P45452
Residue:
471
  
Inhibitor
Name:
BDBM50305832
Synonyms:
4-((5-(2-(4-methoxybenzylcarbamoyl)pyridin-4-yl)-2H-tetrazol-2-yl)methyl)benzoic acid | CHEMBL596300
Type:
Small organic molecule
Emp. Form.:
C23H20N6O4
Mol. Mass.:
444.4427
SMILES:
COc1ccc(CNC(=O)c2cc(ccn2)-c2nnn(Cc3ccc(cc3)C(O)=O)n2)cc1
: