Target
Cytochrome P450 3A4
Ligand
BDBM50305883
Substrate
Meas. Tech.
ChEMBL_605306 (CHEMBL1071331)
IC50
16±n/a nM
Citation
 Lin, HYamashita, DSZeng, JXie, RVerma, SLuengo, JIRhodes, NZhang, SRobell, KAChoudhry, AELai, ZKumar, RMinthorn, EABrown, KKHeerding, DA 2,3,5-Trisubstituted pyridines as selective AKT inhibitors. Part II: Improved drug-like properties and kinase selectivity from azaindazoles. Bioorg Med Chem Lett 20:679-83 (2010)  
Target
Name:
Cytochrome P450 3A4
Synonyms:
Albendazole monooxygenase CP3A4_HUMAN CYP3A4 CYPIIIA4 Cytochrome P450 3A4 (CYP3A4) Nifedipine oxidase Taurochenodeoxycholate 6-alpha-hydroxylase
Type:
Enzyme
Mol. Mass.:
57349.57
Organism:
Homo sapiens (Human)
Description:
Residue:
503
  
Inhibitor
Name:
BDBM50305883
Synonyms:
(S)-1-(6-(furan-3-yl)-5-(3-methyl-1H-pyrazolo[3,4-c]pyridin-5-yl)pyridin-3-yloxy)-3-(1H-indol-3-yl)propan-2-amine | CHEMBL594933
Type:
Small organic molecule
Emp. Form.:
C27H24N6O2
Mol. Mass.:
464.5185
SMILES:
Cc1n[nH]c2cnc(cc12)-c1cc(OC[C@@H](N)Cc2c[nH]c3ccccc23)cnc1-c1ccoc1
: