Target
Cannabinoid receptor 2
Ligand
BDBM50306008
Substrate
Meas. Tech.
ChEMBL_605682 (CHEMBL1071212)
Ki
0.9±n/a nM
Citation
 Gilbert, EJZhou, GWong, MKTong, LShankar, BBHuang, CKelly, JLavey, BJMcCombie, SWChen, LRizvi, RDong, YShu, YKozlowski, JAShih, NYHipkin, RWGonsiorek, WMalikzay, ALunn, CAFavreau, LLundell, DJ Non-aromatic A-ring replacement in the triaryl bis-sulfone CB2 receptor inhibitors. Bioorg Med Chem Lett 20:608-11 (2010)  
Target
Name:
Cannabinoid receptor 2
Synonyms:
CANNABINOID CB2 CB2 CB2B CNR2_HUMAN Cannabinoid CB2 receptor Cannabinoid receptor 2 (CB2R) | hCB2
Type:
G Protein-Coupled Receptor (GPCR)
Mol. Mass.:
39690.94
Organism:
Homo sapiens (Human)
Description:
P34972
Residue:
360
  
Inhibitor
Name:
BDBM50306008
Synonyms:
1,1,1-trifluoro-N-(6-(2-(pyridin-2-ylsulfonyl)-5-(trifluoromethoxy)phenylsulfonyl)-6-azaspiro[2.5]octan-1-yl)methanesulfonamide | CHEMBL595223
Type:
Small organic molecule
Emp. Form.:
C20H19F6N3O7S3
Mol. Mass.:
623.566
SMILES:
FC(F)(F)Oc1ccc(c(c1)S(=O)(=O)N1CCC2(CC2NS(=O)(=O)C(F)(F)F)CC1)S(=O)(=O)c1ccccn1
: