Target
RAC-alpha serine/threonine-protein kinase
Ligand
BDBM50306093
Substrate
Meas. Tech.
ChEMBL_606053 (CHEMBL1071952)
IC50
8±n/a nM
Citation
 Lin, HYamashita, DSZeng, JXie, RWang, WNidarmarthy, SLuengo, JIRhodes, NKnick, VBChoudhry, AELai, ZMinthorn, EAStrum, SLWood, ERElkins, PAConcha, NOHeerding, DA 2,3,5-Trisubstituted pyridines as selective AKT inhibitors-Part I: Substitution at 2-position of the core pyridine for ROCK1 selectivity. Bioorg Med Chem Lett 20:673-8 (2010)  
Target
Name:
RAC-alpha serine/threonine-protein kinase
Synonyms:
AKT phosphorylation (p-AKT) AKT1/PPP1CA C-AKT PKB alpha Protein kinase B Protein kinase B (Akt 1) Protein kinase B alpha Proto-oncogene Akt (Akt1) Proto-oncogene c-Akt (AKT1) RAC-PK-alpha RAC-alpha serine/threonine-protein kinase (AKT1) | RAC-alpha serine/threonine-protein kinase (pAKT)
Type:
Enzyme
Mol. Mass.:
55681.25
Organism:
Homo sapiens (Human)
Description:
P31749
Residue:
480
  
Inhibitor
Name:
BDBM50306093
Synonyms:
(S)-1-(6-(furan-3-yl)-5-(3-methyl-1H-indazol-5-yl)pyridin-3-yloxy)-3-(1H-pyrrolo[2,3-b]pyridin-3-yl)propan-2-amine | CHEMBL594310
Type:
Small organic molecule
Emp. Form.:
C27H24N6O2
Mol. Mass.:
464.5185
SMILES:
Cc1n[nH]c2ccc(cc12)-c1cc(OC[C@@H](N)Cc2c[nH]c3ncccc23)cnc1-c1ccoc1
: