Target
Stearoyl-CoA desaturase
Ligand
BDBM50306129
Substrate
Meas. Tech.
ChEMBL_606058 (CHEMBL1071957)
IC50
1±n/a nM
Citation
 Uto, YKiyotsuka, YUeno, YMiyazawa, YKurata, HOgata, TDeguchi, TYamada, MWatanabe, NKonishi, MKurikawa, NTakagi, TWakimoto, SKono, KOhsumi, J Novel spiropiperidine-based stearoyl-CoA desaturase-1 inhibitors: Identification of 1'-{6-[5-(pyridin-3-ylmethyl)-1,3,4-oxadiazol-2-yl]pyridazin-3-yl}-5-(trifluoromethyl)-3,4-dihydrospiro[chromene-2,4'-piperidine]. Bioorg Med Chem Lett 20:746-54 (2010)  
Target
Name:
Stearoyl-CoA desaturase
Synonyms:
Acyl-CoA desaturase SCD SCDOS Stearoyl-CoA (SCD1) | Stearoyl-CoA desaturase 1
Type:
Enzyme
Mol. Mass.:
41537.27
Organism:
Homo sapiens (Human)
Description:
O00767
Residue:
359
  
Inhibitor
Name:
BDBM50306129
Synonyms:
1'-(6-(3-(pyridin-3-ylmethyl)-1H-1,2,4-triazol-5-yl)pyridazin-3-yl)-5-(trifluoromethyl)spiro[chroman-2,4'-piperidine] | CHEMBL594071
Type:
Small organic molecule
Emp. Form.:
C26H24F3N7O
Mol. Mass.:
507.5103
SMILES:
FC(F)(F)c1cccc2OC3(CCN(CC3)c3ccc(nn3)-c3nnc(Cc4cccnc4)[nH]3)CCc12
: