Target
Cytochrome P450 3A4
Ligand
BDBM50306158
Substrate
Meas. Tech.
ChEMBL_606336 (CHEMBL1071990)
IC50
1300±n/a nM
Citation
 Lin, HYamashita, DSXie, RZeng, JWang, WLeber, JSafonov, IGVerma, SLi, MLafrance, LVenslavsky, JTakata, DLuengo, JIKahana, JAZhang, SRobell, KALevy, DKumar, RChoudhry, AESchaber, MLai, ZBrown, BSDonovan, BTMinthorn, EABrown, KKHeerding, DA Tetrasubstituted pyridines as potent and selective AKT inhibitors: Reduced CYP450 and hERG inhibition of aminopyridines. Bioorg Med Chem Lett 20:684-8 (2010)  
Target
Name:
Cytochrome P450 3A4
Synonyms:
Albendazole monooxygenase CP3A4_HUMAN CYP3A4 CYPIIIA4 Cytochrome P450 3A4 (CYP3A4) Nifedipine oxidase Taurochenodeoxycholate 6-alpha-hydroxylase
Type:
Enzyme
Mol. Mass.:
57349.57
Organism:
Homo sapiens (Human)
Description:
Residue:
503
  
Inhibitor
Name:
BDBM50306158
Synonyms:
3-((S)-2-amino-3-(1H-indol-3-yl)propoxy)-5-(3-methyl-1H-pyrazolo[3,4-c]pyridin-5-yl)-6-(2-methylfuran-3-yl)pyridin-2-amine | CHEMBL595459
Type:
Small organic molecule
Emp. Form.:
C28H27N7O2
Mol. Mass.:
493.5597
SMILES:
Cc1n[nH]c2cnc(cc12)-c1cc(OC[C@@H](N)Cc2c[nH]c3ccccc23)c(N)nc1-c1ccoc1C
: