Target
RAC-gamma serine/threonine-protein kinase
Ligand
BDBM50306165
Substrate
Meas. Tech.
ChEMBL_606084 (CHEMBL1072612)
IC50
1±n/a nM
Citation
 Lin, HYamashita, DSXie, RZeng, JWang, WLeber, JSafonov, IGVerma, SLi, MLafrance, LVenslavsky, JTakata, DLuengo, JIKahana, JAZhang, SRobell, KALevy, DKumar, RChoudhry, AESchaber, MLai, ZBrown, BSDonovan, BTMinthorn, EABrown, KKHeerding, DA Tetrasubstituted pyridines as potent and selective AKT inhibitors: Reduced CYP450 and hERG inhibition of aminopyridines. Bioorg Med Chem Lett 20:684-8 (2010)  
Target
Name:
RAC-gamma serine/threonine-protein kinase
Synonyms:
AKT3 PKB gamma Protein kinase Akt-3 Protein kinase B, gamma RAC-gamma serine/threonine-protein kinase Serine/threonine-protein kinase AKT | Serine/threonine-protein kinase AKT3
Type:
Enzyme
Mol. Mass.:
55769.36
Organism:
Homo sapiens (Human)
Description:
Residue:
479
  
Inhibitor
Name:
BDBM50306165
Synonyms:
3-((2S)-2-amino-3-(2-amino-5-(3-methyl-1H-pyrazolo[4,3-b]pyrazin-5-yl)-6-(2-methylfuran-3-yl)pyridin-3-yloxy)propyl)-1H-indole-2-carboxamide | CHEMBL594072
Type:
Small organic molecule
Emp. Form.:
C28H27N9O3
Mol. Mass.:
537.5725
SMILES:
Cc1n[nH]c2ncc(nc12)-c1cc(OC[C@@H](N)Cc2c([nH]c3ccccc23)C(N)=O)c(N)nc1-c1ccoc1C
: