Target
Protein mono-ADP-ribosyltransferase PARP3 [R100H]
Ligand
BDBM50306256
Substrate
Meas. Tech.
ChEMBL_607027 (CHEMBL1074655)
IC50
70±n/a nM
Citation
 Torrisi, CBisbocci, MIngenito, ROntoria, JMRowley, MSchultz-Fademrecht, CToniatti, CJones, P Discovery and SAR of novel, potent and selective hexahydrobenzonaphthyridinone inhibitors of poly(ADP-ribose)polymerase-1 (PARP-1). Bioorg Med Chem Lett 20:448-52 (2010)  
Target
Name:
Protein mono-ADP-ribosyltransferase PARP3 [R100H]
Synonyms:
(ARTD3 or PARP3) ADPRT3 Human diphtheria toxin-like ADP-ribosyltransferase (ARTD3 or PARP3) PARP3_HUMAN Poly [ADP-ribose] polymerase 3 (PARP-3) | Poly(ADP-ribose) polymerase-3 (ARTD3/PARP3)
Type:
PROTEIN
Mol. Mass.:
60071.85
Organism:
Homo sapiens (Human)
Description:
Q9Y6F1[R100H]
Residue:
533
  
Inhibitor
Name:
BDBM50306256
Synonyms:
1-(3-(pyrazin-2-yl)propanoyl)-2,3,9,9a-tetrahydro-1H-benzo[de][1,7]naphthyridin-7(8H)-one | CHEMBL609002
Type:
Small organic molecule
Emp. Form.:
C18H18N4O2
Mol. Mass.:
322.3611
SMILES:
O=C(CCc1cnccn1)N1CCc2cccc3C(=O)NCC1c23
: