Target
D(1A) dopamine receptor
Ligand
BDBM50306458
Substrate
Meas. Tech.
ChEMBL_609907 (CHEMBL1074769)
Ki
2.3±n/a nM
Citation
 Sasikumar, TKBurnett, DAGreenlee, WJSmith, MFawzi, AZhang, HLachowicz, JE Remote functionalization of SCH 39166: discovery of potent and selective benzazepine dopamine D1 receptor antagonists. Bioorg Med Chem Lett 20:832-5 (2010)  
Target
Name:
D(1A) dopamine receptor
Synonyms:
DA D1 receptor DRD1 Dopamine D1 receptor Dopamine D1A
Type:
Enzyme
Mol. Mass.:
49303.43
Organism:
Homo sapiens (Human)
Description:
P21728
Residue:
446
  
Inhibitor
Name:
BDBM50306458
Synonyms:
(6aS,13bS)-methyl 11-chloro-12-hydroxy-7-methyl-6,6a,7,8,9,13b-hexahydro-5H-benzo[d]naphtho[2,1-b]azepine-4-carboxylate | CHEMBL598730
Type:
Small organic molecule
Emp. Form.:
C21H22ClNO3
Mol. Mass.:
371.857
SMILES:
COC(=O)c1cccc2[C@H]3[C@H](CCc12)N(C)CCc1cc(Cl)c(O)cc31
: