Target
Receptor-type tyrosine-protein kinase FLT3
Ligand
BDBM50306683
Substrate
Meas. Tech.
ChEMBL_611557 (CHEMBL1066401)
IC50
46000±n/a nM
Citation
 Nishii, HChiba, TMorikami, KFukami, TASakamoto, HKo, KKoyano, H Discovery of 6-benzyloxyquinolines as c-Met selective kinase inhibitors. Bioorg Med Chem Lett 20:1405-9 (2010)  
Target
Name:
Receptor-type tyrosine-protein kinase FLT3
Synonyms:
CD135 FL cytokine receptor FLK2 FLT3 Fetal liver kinase-2 Fms-like tyrosine kinase 3 (Flt-3) STK-1 Stem cell tyrosine kinase 1
Type:
Enzyme
Mol. Mass.:
112888.62
Organism:
Homo sapiens (Human)
Description:
P36888
Residue:
993
  
Inhibitor
Name:
BDBM50306683
Synonyms:
(R)-6-(1-(2,6-dichloro-3-fluorophenyl)ethoxy)quinoline | CHEMBL600795
Type:
Small organic molecule
Emp. Form.:
C17H12Cl2FNO
Mol. Mass.:
336.188
SMILES:
C[C@@H](Oc1ccc2ncccc2c1)c1c(Cl)ccc(F)c1Cl
: