Target
Prostaglandin G/H synthase 2
Ligand
BDBM50306908
Substrate
Meas. Tech.
ChEMBL_608987 (CHEMBL1073129)
IC50
16800±n/a nM
Citation
 Chowdhury, MAAbdellatif, KRDong, YYu, GHuang, ZRahman, MDas, DVelázquez, CASuresh, MRKnaus, EE Celecoxib analogs possessing a N-(4-nitrooxybutyl)piperidin-4-yl or N-(4-nitrooxybutyl)-1,2,3,6-tetrahydropyridin-4-yl nitric oxide donor moiety: synthesis, biological evaluation and nitric oxide release studies. Bioorg Med Chem Lett 20:1324-9 (2010)  
Target
Name:
Prostaglandin G/H synthase 2
Synonyms:
COX2 Cyclooxygenase 2 (COX-2) Cyclooxygenase-2 (COX-2 AA) Cyclooxygenase-2 (COX-2) PGH2_HUMAN PHS II Prostaglandin E synthase/G/H synthase 2 Prostaglandin-endoperoxide synthase 2
Type:
Enzyme
Mol. Mass.:
69003.89
Organism:
Homo sapiens (Human)
Description:
Recombinant Cox-2 provided by Cayman (Cayman Chemical Co.,Ann Arbor, MI).
Residue:
604
  
Inhibitor
Name:
BDBM50306908
Synonyms:
4-(4-(1-(4-sulfamoylphenyl)-3-(trifluoromethyl)-1H-pyrazol-5-yl)piperidin-1-yl)butyl nitrate | CHEMBL602676
Type:
Small organic molecule
Emp. Form.:
C19H24F3N5O5S
Mol. Mass.:
491.485
SMILES:
NS(=O)(=O)c1ccc(cc1)-n1nc(cc1C1CCN(CCCCO[N+]([O-])=O)CC1)C(F)(F)F
: