Target
P2Y purinoceptor 12
Ligand
BDBM50307010
Substrate
Meas. Tech.
ChEMBL_609034 (CHEMBL1064501)
Ki
1.5±n/a nM
Citation
 Parlow, JJBurney, MWCase, BLGirard, TJHall, KAHarris, PKHiebsch, RRHuff, RMLachance, RMMischke, DARapp, SRWoerndle, RSEnnis, MD Part II: piperazinyl-glutamate-pyridines as potent orally bioavailable P2Y12 antagonists for inhibition of platelet aggregation. Bioorg Med Chem Lett 20:1388-94 (2010)  
Target
Name:
P2Y purinoceptor 12
Synonyms:
ADP-glucose receptor HORK3 P2T(AC) P2Y(AC) P2Y(cyc) P2Y12 platelet ADP receptor Purinergic receptor P2Y12 | SP1999
Type:
Enzyme
Mol. Mass.:
39458.48
Organism:
Homo sapiens (Human)
Description:
Q9H244
Residue:
342
  
Inhibitor
Name:
BDBM50307010
Synonyms:
(4S)4-{[(4-{4-[(Methylamino)ethyl]piperidin-1-yl}-6-phenylpyridin-2-yl)carbonyl]amino}-5-oxo-5-{4-[(pentyloxy)carbonyl]-piperazin-1-yl}pentanoic Acid CHEMBL589519
Type:
Small organic molecule
Emp. Form.:
C34H48N6O6
Mol. Mass.:
636.7815
SMILES:
CCCCCOC(=O)N1CCN(CC1)C(=O)[C@H](CCC(O)=O)NC(=O)c1cc(cc(n1)-c1ccccc1)N1CCC(CNC)CC1
: