Target
Monoacylglycerol lipase ABHD6
Ligand
BDBM50307074
Substrate
Meas. Tech.
ChEMBL_609360 (CHEMBL1072746)
IC50
2120±n/a nM
Citation
 Long, JZJin, XAdibekian, ALi, WCravatt, BF Characterization of tunable piperidine and piperazine carbamates as inhibitors of endocannabinoid hydrolases. J Med Chem 53:1830-42 (2010)  
Target
Name:
Monoacylglycerol lipase ABHD6
Synonyms:
ABHD6_MOUSE Abhd6 Monoacylglycerol lipase ABHD6
Type:
Single-pass type II membrane protein; hydrolase
Mol. Mass.:
38216.17
Organism:
Mus musculus (mouse)
Description:
Assays were using membranes of recombinant Abh6 transiently transfected in COS-7 cells.
Residue:
336
  
Inhibitor
Name:
BDBM50307074
Synonyms:
4-Nitrophenyl 4-(9H-Xanthen-9-yl)piperazine-1-carboxylate | CHEMBL599990
Type:
Small organic molecule
Emp. Form.:
C24H21N3O5
Mol. Mass.:
431.4406
SMILES:
[O-][N+](=O)c1ccc(OC(=O)N2CCN(CC2)C2c3ccccc3Oc3ccccc23)cc1
: