Target
Monoacylglycerol lipase ABHD6
Ligand
BDBM50307076
Substrate
Meas. Tech.
ChEMBL_609360 (CHEMBL1072746)
IC50
3430±n/a nM
Citation
 Long, JZJin, XAdibekian, ALi, WCravatt, BF Characterization of tunable piperidine and piperazine carbamates as inhibitors of endocannabinoid hydrolases. J Med Chem 53:1830-42 (2010)  
Target
Name:
Monoacylglycerol lipase ABHD6
Synonyms:
ABHD6_MOUSE Abhd6 Monoacylglycerol lipase ABHD6
Type:
Single-pass type II membrane protein; hydrolase
Mol. Mass.:
38216.17
Organism:
Mus musculus (mouse)
Description:
Assays were using membranes of recombinant Abh6 transiently transfected in COS-7 cells.
Residue:
336
  
Inhibitor
Name:
BDBM50307076
Synonyms:
4-Nitrophenyl 4-(Hydroxydinaphthalen-2-ylmethyl)piperidine-1-carboxylate | CHEMBL597514
Type:
Small organic molecule
Emp. Form.:
C33H28N2O5
Mol. Mass.:
532.5858
SMILES:
OC(C1CCN(CC1)C(=O)Oc1ccc(cc1)[N+]([O-])=O)(c1ccc2ccccc2c1)c1ccc2ccccc2c1
: