Target
Fatty-acid amide hydrolase 1
Ligand
BDBM50307081
Substrate
Meas. Tech.
ChEMBL_609358 (CHEMBL1072744)
IC50
5±n/a nM
Citation
 Long, JZJin, XAdibekian, ALi, WCravatt, BF Characterization of tunable piperidine and piperazine carbamates as inhibitors of endocannabinoid hydrolases. J Med Chem 53:1830-42 (2010)  
Target
Name:
Fatty-acid amide hydrolase 1
Synonyms:
Anandamide amidohydrolase FAAH1_MOUSE Faah1 Fatty-acid amide hydrolase (FAAH) Oleamide hydrolase 1
Type:
Hydrolase; single-pass membrane protein; homodimer
Mol. Mass.:
63227.28
Organism:
Mus musculus (mouse)
Description:
Mouse brain membranes were used in the assay.
Residue:
579
  
Inhibitor
Name:
BDBM50307081
Synonyms:
4-Nitrophenyl 4-((5-(2-(Trifluoromethoxy)phenyl)furan-2-yl)methyl)piperazine-1-carboxylate | CHEMBL604948
Type:
Small organic molecule
Emp. Form.:
C23H20F3N3O6
Mol. Mass.:
491.4166
SMILES:
[O-][N+](=O)c1ccc(OC(=O)N2CCN(Cc3ccc(o3)-c3ccccc3OC(F)(F)F)CC2)cc1
: