Target
Monoglyceride lipase
Ligand
BDBM50307081
Substrate
Meas. Tech.
ChEMBL_609359 (CHEMBL1072745)
IC50
70±n/a nM
Citation
 Long, JZJin, XAdibekian, ALi, WCravatt, BF Characterization of tunable piperidine and piperazine carbamates as inhibitors of endocannabinoid hydrolases. J Med Chem 53:1830-42 (2010)  
Target
Name:
Monoglyceride lipase
Synonyms:
MAG lipase Mgll Monoglyceride Lipase (MGL)
Type:
Hydrolase
Mol. Mass.:
33391.67
Organism:
Mus musculus (mouse)
Description:
Assays were using membranes of recombinant MAG Lipase transiently transfected in COS-7 cells.
Residue:
303
  
Inhibitor
Name:
BDBM50307081
Synonyms:
4-Nitrophenyl 4-((5-(2-(Trifluoromethoxy)phenyl)furan-2-yl)methyl)piperazine-1-carboxylate | CHEMBL604948
Type:
Small organic molecule
Emp. Form.:
C23H20F3N3O6
Mol. Mass.:
491.4166
SMILES:
[O-][N+](=O)c1ccc(OC(=O)N2CCN(Cc3ccc(o3)-c3ccccc3OC(F)(F)F)CC2)cc1
: