Target
Monoacylglycerol lipase ABHD6
Ligand
BDBM50307088
Substrate
Meas. Tech.
ChEMBL_609360 (CHEMBL1072746)
IC50
130±n/a nM
Citation
 Long, JZJin, XAdibekian, ALi, WCravatt, BF Characterization of tunable piperidine and piperazine carbamates as inhibitors of endocannabinoid hydrolases. J Med Chem 53:1830-42 (2010)  
Target
Name:
Monoacylglycerol lipase ABHD6
Synonyms:
ABHD6_MOUSE Abhd6 Monoacylglycerol lipase ABHD6
Type:
Single-pass type II membrane protein; hydrolase
Mol. Mass.:
38216.17
Organism:
Mus musculus (mouse)
Description:
Assays were using membranes of recombinant Abh6 transiently transfected in COS-7 cells.
Residue:
336
  
Inhibitor
Name:
BDBM50307088
Synonyms:
4-Nitrophenyl 4-(5-Bromo-2-hydroxybenzyl)piperazine-1-carboxylate | CHEMBL591688
Type:
Small organic molecule
Emp. Form.:
C18H18BrN3O5
Mol. Mass.:
436.257
SMILES:
Oc1ccc(Br)cc1CN1CCN(CC1)C(=O)Oc1ccc(cc1)[N+]([O-])=O
: