Target
11-beta-hydroxysteroid dehydrogenase 1
Ligand
BDBM50307108
Substrate
Meas. Tech.
ChEMBL_609376 (CHEMBL1072762)
IC50
2060±n/a nM
Citation
 Rollinger, JMKratschmar, DVSchuster, DPfisterer, PHGumy, CAubry, EMBrandstötter, SStuppner, HWolber, GOdermatt, A 11beta-Hydroxysteroid dehydrogenase 1 inhibiting constituents from Eriobotrya japonica revealed by bioactivity-guided isolation and computational approaches. Bioorg Med Chem 18:1507-15 (2010)  
Target
Name:
11-beta-hydroxysteroid dehydrogenase 1
Synonyms:
11-DH 11-beta-Hydroxysteroid Dehydrogenase 1 (11-beta-HSD1) 11-beta-hydroxysteroid dehydrogenase 1 (11HSD1) Corticosteroid 11-beta-dehydrogenase isozyme 1 (11-beta-HSD-1) Corticosteroid 11-beta-dehydrogenase isozyme 1 (11beta-HSD1) HSD11 HSD11L | SDR26C1
Type:
Enzyme
Mol. Mass.:
32409.16
Organism:
Homo sapiens (Human)
Description:
P28845
Residue:
292
  
Inhibitor
Name:
BDBM50307108
Synonyms:
11-keto-ursolic acid | CHEMBL603710
Type:
Small organic molecule
Emp. Form.:
C30H46O4
Mol. Mass.:
470.6838
SMILES:
C[C@@H]1CC[C@@]2(CC[C@]3(C)C(=CC(=O)[C@@H]4[C@@]5(C)CC[C@H](O)C(C)(C)[C@@H]5CC[C@@]34C)[C@@H]2[C@H]1C)C(O)=O
: