Target
Prostaglandin E2 receptor EP3 subtype
Ligand
BDBM50307424
Substrate
Meas. Tech.
ChEMBL_610979 (CHEMBL1070310)
Ki
0.16±n/a nM
Citation
 Asada, MIwahashi, MObitsu, TKinoshita, ANakai, YOnoda, TNagase, TTanaka, MYamaura, YTakizawa, HYoshikawa, KSato, KNarita, MOhuchida, SNakai, HToda, M 3-(2-Aminocarbonylphenyl)propanoic acid analogs as potent and selective EP3 receptor antagonists. part 2: optimization of the side chains to improve in vitro and in vivo potencies. Bioorg Med Chem 18:1641-58 (2010)  
Target
Name:
Prostaglandin E2 receptor EP3 subtype
Synonyms:
PE2R3_MOUSE Prostaglandin E2 receptor EP3 isoform alpha Prostanoid EP3 receptor Ptgerep3
Type:
G-protein coupled receptor
Mol. Mass.:
40092.50
Organism:
Mus musculus (Mouse)
Description:
Residue:
365
  
Inhibitor
Name:
BDBM50307424
Synonyms:
3-[2-({[1-(4-Methoxy-3-methylphenyl)-3-methylbutyl]-amino}carbonyl)-4-(phenoxymethyl)phenyl]propanoic acid | CHEMBL598613
Type:
Small organic molecule
Emp. Form.:
C30H35NO5
Mol. Mass.:
489.6026
SMILES:
COc1ccc(cc1C)C(CC(C)C)NC(=O)c1cc(COc2ccccc2)ccc1CCC(O)=O
: