Target
Prostaglandin E2 receptor EP3 subtype
Ligand
BDBM50307450
Substrate
Meas. Tech.
ChEMBL_610979 (CHEMBL1070310)
Ki
0.19±n/a nM
Citation
 Asada, MIwahashi, MObitsu, TKinoshita, ANakai, YOnoda, TNagase, TTanaka, MYamaura, YTakizawa, HYoshikawa, KSato, KNarita, MOhuchida, SNakai, HToda, M 3-(2-Aminocarbonylphenyl)propanoic acid analogs as potent and selective EP3 receptor antagonists. part 2: optimization of the side chains to improve in vitro and in vivo potencies. Bioorg Med Chem 18:1641-58 (2010)  
Target
Name:
Prostaglandin E2 receptor EP3 subtype
Synonyms:
PE2R3_MOUSE Prostaglandin E2 receptor EP3 isoform alpha Prostanoid EP3 receptor Ptgerep3
Type:
G-protein coupled receptor
Mol. Mass.:
40092.50
Organism:
Mus musculus (Mouse)
Description:
Residue:
365
  
Inhibitor
Name:
BDBM50307450
Synonyms:
3-[4-[(2,4-Difluorophenoxy)methyl]-2-({[1-(3,5-dimethylphenyl)-3-methylbutyl]amino}carbonyl)phenyl]propanoic acid | CHEMBL605974
Type:
Small organic molecule
Emp. Form.:
C30H33F2NO4
Mol. Mass.:
509.5841
SMILES:
CC(C)CC(NC(=O)c1cc(COc2ccc(F)cc2F)ccc1CCC(O)=O)c1cc(C)cc(C)c1
: