Target
RAC-beta serine/threonine-protein kinase
Ligand
BDBM50307975
Substrate
Meas. Tech.
ChEMBL_608104 (CHEMBL1072809)
IC50
25±n/a nM
Citation
 McHardy, TCaldwell, JJCheung, KMHunter, LJTaylor, KRowlands, MRuddle, RHenley, Ade Haven Brandon, AValenti, MDavies, TGFazal, LSeavers, LRaynaud, FIEccles, SAAherne, GWGarrett, MDCollins, I Discovery of 4-amino-1-(7H-pyrrolo[2,3-d]pyrimidin-4-yl)piperidine-4-carboxamides as selective, orally active inhibitors of protein kinase B (Akt). J Med Chem 53:2239-49 (2010)  
Target
Name:
RAC-beta serine/threonine-protein kinase
Synonyms:
AKT2 PKB beta Protein kinase B (Akt 2) Protein kinase B, beta RAC-alpha serine/threonine-protein kinase (AKT2) RAC-beta serine/threonine-protein kinase (AKT2) Serine/threonine-protein kinase AKT2 | Serine/threonine-protein kinase Rac alpha/beta
Type:
Enzyme
Mol. Mass.:
55766.64
Organism:
Homo sapiens (Human)
Description:
Residue:
481
  
Inhibitor
Name:
BDBM50307975
Synonyms:
4-Amino-N-(4-chlorobenzyl)-N-methyl-1-(7H-pyrrolo[2,3-d]pyrimidin-4-yl)piperidine-4-carboxamide | CHEMBL597803
Type:
Small organic molecule
Emp. Form.:
C20H23ClN6O
Mol. Mass.:
398.889
SMILES:
CN(Cc1ccc(Cl)cc1)C(=O)C1(N)CCN(CC1)c1ncnc2[nH]ccc12
: