Target
Prostaglandin E2 receptor EP4 subtype
Ligand
BDBM50308131
Substrate
Meas. Tech.
ChEMBL_610063 (CHEMBL1072472)
Ki
0.560000±n/a nM
Citation
 Blouin, MHan, YBurch, JFarand, JMellon, CGaudreault, MWrona, MLévesque, JFDenis, DMathieu, MCStocco, RVigneault, ETherien, AClark, PRowland, SXu, DO'Neill, GDucharme, YFriesen, R The discovery of 4-{1-[({2,5-dimethyl-4-[4-(trifluoromethyl)benzyl]-3-thienyl}carbonyl)amino]cyclopropyl}benzoic acid (MK-2894), a potent and selective prostaglandin E2 subtype 4 receptor antagonist. J Med Chem 53:2227-38 (2010)  
Target
Name:
Prostaglandin E2 receptor EP4 subtype
Synonyms:
PE2R4_HUMAN PGE2 receptor EP4 subtype PTGER4 Prostanoid EP4 receptor
Type:
Enzyme
Mol. Mass.:
53134.53
Organism:
Homo sapiens (Human)
Description:
P35408
Residue:
488
  
Inhibitor
Name:
BDBM50308131
Synonyms:
4-{1-[({2,5-Dimethyl-4-[4-(trifluoromethyl)benzyl]-3-thienyl}-carbonyl)amino]cyclopropyl}benzoic Acid | CHEMBL597997
Type:
Small organic molecule
Emp. Form.:
C25H22F3NO3S
Mol. Mass.:
473.507
SMILES:
Cc1sc(C)c(C(=O)NC2(CC2)c2ccc(cc2)C(O)=O)c1Cc1ccc(cc1)C(F)(F)F
: