Target
Prostaglandin E2 receptor EP4 subtype
Ligand
BDBM50308133
Substrate
Meas. Tech.
ChEMBL_610063 (CHEMBL1072472)
Ki
0.870000±n/a nM
Citation
 Blouin, MHan, YBurch, JFarand, JMellon, CGaudreault, MWrona, MLévesque, JFDenis, DMathieu, MCStocco, RVigneault, ETherien, AClark, PRowland, SXu, DO'Neill, GDucharme, YFriesen, R The discovery of 4-{1-[({2,5-dimethyl-4-[4-(trifluoromethyl)benzyl]-3-thienyl}carbonyl)amino]cyclopropyl}benzoic acid (MK-2894), a potent and selective prostaglandin E2 subtype 4 receptor antagonist. J Med Chem 53:2227-38 (2010)  
Target
Name:
Prostaglandin E2 receptor EP4 subtype
Synonyms:
PE2R4_HUMAN PGE2 receptor EP4 subtype PTGER4 Prostanoid EP4 receptor
Type:
Enzyme
Mol. Mass.:
53134.53
Organism:
Homo sapiens (Human)
Description:
P35408
Residue:
488
  
Inhibitor
Name:
BDBM50308133
Synonyms:
4-[(1R)-1-({[2,5-Dichloro-4-(3-chlorobenzyl)-3-thienyl]carbonyl}amino)ethyl]benzoic acid | CHEMBL591431
Type:
Small organic molecule
Emp. Form.:
C21H16Cl3NO3S
Mol. Mass.:
468.781
SMILES:
C[C@@H](NC(=O)c1c(Cl)sc(Cl)c1Cc1cccc(Cl)c1)c1ccc(cc1)C(O)=O
: