Target
Purine nucleoside phosphorylase
Ligand
BDBM50195587
Substrate
Meas. Tech.
ChEMBL_613435 (CHEMBL1069546)
Ki
41±n/a nM
Citation
 Hikishima, SHashimoto, MMagnowska, LBzowska, AYokomatsu, T Structural-based design and synthesis of novel 9-deazaguanine derivatives having a phosphate mimic as multi-substrate analogue inhibitors for mammalian PNPs. Bioorg Med Chem 18:2275-84 (2010)  
Target
Name:
Purine nucleoside phosphorylase
Synonyms:
Inosine phosphorylase PNP Purine Nucleoside Phosphorylase (PNP) | Purine nucleoside phosphorylase
Type:
Enzyme
Mol. Mass.:
32035.18
Organism:
Bos taurus (bovine)
Description:
Residue:
289
  
Inhibitor
Name:
BDBM50195587
Synonyms:
1,4-DIDEOXY-4-AZA-1-(S)-(9-DEAZAHYPOXANTHIN-9-YL)-D-RIBITOL CHEMBL1213652 Immucillin-H
Type:
Small organic molecule
Emp. Form.:
C11H14N4O4
Mol. Mass.:
266.2533
SMILES:
OC[C@H]1N[C@H]([C@H](O)[C@@H]1O)c1c[nH]c2c1nc[nH]c2=O
: