Target
Non-lysosomal glucosylceramidase
Ligand
BDBM18351
Substrate
Meas. Tech.
ChEMBL_607224 (CHEMBL1070064)
IC50
28800±n/a nM
Citation
 van Scherpenzeel, Mvan den Berg, RJDonker-Koopman, WELiskamp, RMAerts, JMOverkleeft, HSPieters, RJ Nanomolar affinity, iminosugar-based chemical probes for specific labeling of lysosomal glucocerebrosidase. Bioorg Med Chem 18:267-73 (2010)  
Target
Name:
Non-lysosomal glucosylceramidase
Synonyms:
Beta-glucosidase GBA2_HUMAN SPG46
Type:
PROTEIN
Mol. Mass.:
104639.04
Organism:
Homo sapiens (Human)
Description:
ChEMBL_1435476
Residue:
927
  
Inhibitor
Name:
BDBM18351
Synonyms:
(2R,3R,4R,5S)-2-(Hydroxymethyl)piperidine-3,4,5-triol, 10 1-Deoxynojirimycin CHEMBL307429 US9181184, 1 | dNM
Type:
natural product
Emp. Form.:
C6H13NO4
Mol. Mass.:
163.1717
SMILES:
OC[C@H]1NC[C@H](O)[C@@H](O)[C@@H]1O
: