Target
Prostaglandin G/H synthase 2
Ligand
BDBM50166283
Substrate
Meas. Tech.
ChEMBL_607539 (CHEMBL1071442)
IC50
7000±n/a nM
Citation
 Biava, MPorretta, GCPoce, GBattilocchio, CManetti, FBotta, MForli, SSautebin, LRossi, APergola, CGhelardini, CGaleotti, NMakovec, FGiordani, AAnzellotti, PPatrignani, PAnzini, M Novel ester and acid derivatives of the 1,5-diarylpyrrole scaffold as anti-inflammatory and analgesic agents. Synthesis and in vitro and in vivo biological evaluation. J Med Chem 53:723-33 (2010)  
Target
Name:
Prostaglandin G/H synthase 2
Synonyms:
COX2 Cyclooxygenase 2 (COX-2) Cyclooxygenase-2 (COX-2 AA) Cyclooxygenase-2 (COX-2) PGH2_HUMAN PHS II Prostaglandin E synthase/G/H synthase 2 Prostaglandin-endoperoxide synthase 2
Type:
Enzyme
Mol. Mass.:
69003.89
Organism:
Homo sapiens (Human)
Description:
Recombinant Cox-2 provided by Cayman (Cayman Chemical Co.,Ann Arbor, MI).
Residue:
604
  
Inhibitor
Name:
BDBM50166283
Synonyms:
CHEMBL192678 [5-(4-Methanesulfonyl-phenyl)-2-methyl-1-phenyl-1H-pyrrol-3-yl]-acetic acid
Type:
Small organic molecule
Emp. Form.:
C20H19NO4S
Mol. Mass.:
369.434
SMILES:
Cc1c(CC(O)=O)cc(-c2ccc(cc2)S(C)(=O)=O)n1-c1ccccc1
: