Target
Tyrosine-protein phosphatase non-receptor type 2
Ligand
BDBM50219566
Substrate
Meas. Tech.
ChEMBL_607677 (CHEMBL1071697)
Ki
5±n/a nM
Citation
 Combs, AP Recent advances in the discovery of competitive protein tyrosine phosphatase 1B inhibitors for the treatment of diabetes, obesity, and cancer. J Med Chem 53:2333-44 (2010)  
Target
Name:
Tyrosine-protein phosphatase non-receptor type 2
Synonyms:
PTN2_HUMAN PTPT T-cell protein-tyrosine phosphatase TCPTP Tyrosine-protein phosphatase non-receptor type 2 (TC-PTP)
Type:
Protein
Mol. Mass.:
48481.80
Organism:
Homo sapiens (Human)
Description:
P17706
Residue:
415
  
Inhibitor
Name:
BDBM50219566
Synonyms:
4-bromo-3-carboxymethoxy-5-[3-(1-phenylmethanesulfonylpiperidin-4-ylamino)phenyl]thiophene-2-carboxylic acid 5-(3-{[1-(BENZYLSULFONYL)PIPERIDIN-4-YL]AMINO}PHENYL)-4-BROMO-3-(CARBOXYMETHOXY)THIOPHENE-2-CARBOXYLIC ACID | CHEMBL541214
Type:
Small organic molecule
Emp. Form.:
C25H25BrN2O7S2
Mol. Mass.:
609.509
SMILES:
OC(=O)COc1c(Br)c(sc1C(O)=O)-c1cccc(NC2CCN(CC2)S(=O)(=O)Cc2ccccc2)c1
: