Target
Tyrosinase
Ligand
BDBM50241530
Substrate
Meas. Tech.
ChEMBL_608142 (CHEMBL1074831)
IC50
>500000±n/a nM
Citation
 Park, JSKim, DHLee, JKLee, JYKim, DHKim, HKLee, HJKim, HC Natural ortho-dihydroxyisoflavone derivatives from aged Korean fermented soybean paste as potent tyrosinase and melanin formation inhibitors. Bioorg Med Chem Lett 20:1162-4 (2010)  
Target
Name:
Tyrosinase
Synonyms:
TYRO_MOUSE | Tyr
Type:
Protein
Mol. Mass.:
60600.74
Organism:
Mus musculus (Mouse)
Description:
Residue:
533
  
Inhibitor
Name:
BDBM50241530
Synonyms:
CHEMBL513024 | glycitein
Type:
Small organic molecule
Emp. Form.:
C16H12O5
Mol. Mass.:
284.2635
SMILES:
COc1cc2c(cc1O)occ(-c1ccc(O)cc1)c2=O
: