Target
5-hydroxytryptamine receptor 1A
Ligand
BDBM50002177
Substrate
Meas. Tech.
ChEMBL_608856 (CHEMBL1069075)
IC50
20±n/a nM
Citation
 Dilly, SGraulich, ALiégeois, JF Molecular modeling study of 4-phenylpiperazine and 4-phenyl-1,2,3,6-tetrahydropyridine derivatives: a new step towards the design of high-affinity 5-HT1A ligands. Bioorg Med Chem Lett 20:1118-23 (2010)  
Target
Name:
5-hydroxytryptamine receptor 1A
Synonyms:
5-HT-1A 5-hydroxytryptamine receptor 1A (5-HT-1A) ADRB2RL1 Dopamine D2 receptor and serotonin 1a receptor HTR1A | Serotonin receptor 1A
Type:
Mol. Mass.:
46122.49
Organism:
Homo sapiens (Human)
Description:
Residue:
422
  
Inhibitor
Name:
BDBM50002177
Synonyms:
5-Methoxy-3-[4-(4-phenyl-3,6-dihydro-2H-pyridin-1-yl)-butyl]-1H-indole CHEMBL130327
Type:
Small organic molecule
Emp. Form.:
C24H28N2O
Mol. Mass.:
360.4919
SMILES:
COc1ccc2[nH]cc(CCCCN3CCC(=CC3)c3ccccc3)c2c1
: