Target
Adenosine receptor A2b
Ligand
BDBM50309481
Substrate
Meas. Tech.
ChEMBL_609500 (CHEMBL1071772)
EC50
>10000±n/a nM
Citation
 Beattie, DBrearley, ABrown, ZCharlton, SJCox, BFairhurst, RAFozard, JRGedeck, PKirkham, PMeja, KNanson, LNeef, JOakman, HSpooner, GTaylor, RJTurner, RJWest, RWoodward, H Synthesis and evaluation of two series of 4'-aza-carbocyclic nucleosides as adenosine A2A receptor agonists. Bioorg Med Chem Lett 20:1219-24 (2010)  
Target
Name:
Adenosine receptor A2b
Synonyms:
AA2BR_HUMAN ADORA2B Adenosine receptors A2b | Adenosine receptors; A2a & A2b
Type:
G Protein-Coupled Receptor (GPCR)
Mol. Mass.:
36341.22
Organism:
Homo sapiens (Human)
Description:
Residue:
332
  
Inhibitor
Name:
BDBM50309481
Synonyms:
CHEMBL592541 | N-((2S,3S,4R,5R)-5-(2-(2-(1-ethyl-1H-imidazol-4-yl)ethylamino)-6-(pentan-3-ylamino)-9H-purin-9-yl)-3,4-dihydroxytetrahydrofuran-2-yl)propionamide
Type:
Small organic molecule
Emp. Form.:
C25H39N9O3
Mol. Mass.:
513.6357
SMILES:
CCC(CC)Nc1nc(NCCc2cn(CC)cn2)nc2n(cnc12)[C@@H]1C[C@H](NC(=O)CC)[C@@H](O)[C@H]1O
: