Target
5-hydroxytryptamine receptor 1A
Ligand
BDBM50309512
Substrate
Meas. Tech.
ChEMBL_609532 (CHEMBL1072439)
Ki
37±n/a nM
Citation
 Dounay, ABBarta, NSCampbell, BMColeman, CCollantes, EMDenny, LDutta, SGray, DLHou, DIyer, RMaiti, SNOrtwine, DFProbert, AStratman, NCSubedi, RWhisman, TXu, WZoski, K Design, synthesis, and pharmacological evaluation of phenoxy pyridyl derivatives as dual norepinephrine reuptake inhibitors and 5-HT1A partial agonists. Bioorg Med Chem Lett 20:1114-7 (2010)  
Target
Name:
5-hydroxytryptamine receptor 1A
Synonyms:
5-HT-1A 5-hydroxytryptamine receptor 1A (5-HT-1A) ADRB2RL1 Dopamine D2 receptor and serotonin 1a receptor HTR1A | Serotonin receptor 1A
Type:
Mol. Mass.:
46122.49
Organism:
Homo sapiens (Human)
Description:
Residue:
422
  
Inhibitor
Name:
BDBM50309512
Synonyms:
2-(2,3-dichlorophenoxy)-3-(piperidin-4-yl)pyridine | CHEMBL600854
Type:
Small organic molecule
Emp. Form.:
C16H16Cl2N2O
Mol. Mass.:
323.217
SMILES:
Clc1cccc(Oc2ncccc2C2CCNCC2)c1Cl
: