Target
Sodium-dependent noradrenaline transporter
Ligand
BDBM50309516
Substrate
Meas. Tech.
ChEMBL_609533 (CHEMBL1073786)
Ki
143±n/a nM
Citation
 Dounay, ABBarta, NSCampbell, BMColeman, CCollantes, EMDenny, LDutta, SGray, DLHou, DIyer, RMaiti, SNOrtwine, DFProbert, AStratman, NCSubedi, RWhisman, TXu, WZoski, K Design, synthesis, and pharmacological evaluation of phenoxy pyridyl derivatives as dual norepinephrine reuptake inhibitors and 5-HT1A partial agonists. Bioorg Med Chem Lett 20:1114-7 (2010)  
Target
Name:
Sodium-dependent noradrenaline transporter
Synonyms:
Monoamine transporter NET Noradrenaline Transporter (NET) Norepinephrine transporter protein (NET) SLC6A2 Sodium-dependent noradrenaline transporter (NET) | Solute carrier family 6 member 2
Type:
Multi-pass membrane protein
Mol. Mass.:
69337.72
Organism:
Homo sapiens (Human)
Description:
P23975
Residue:
617
  
Inhibitor
Name:
BDBM50309516
Synonyms:
2-(2,4-difluorophenoxy)-3-(piperidin-4-yl)pyridine | CHEMBL598767
Type:
Small organic molecule
Emp. Form.:
C16H16F2N2O
Mol. Mass.:
290.3078
SMILES:
Fc1ccc(Oc2ncccc2C2CCNCC2)c(F)c1
: