Target
Fatty-acid amide hydrolase 1
Ligand
BDBM50309712
Substrate
Meas. Tech.
ChEMBL_610820 (CHEMBL1068137)
IC50
0.2±n/a nM
Citation
 Sit, SYConway, CMXie, KBertekap, RBourin, CBurris, KD Oxime carbamate--discovery of a series of novel FAAH inhibitors. Bioorg Med Chem Lett 20:1272-7 (2010)  
Target
Name:
Fatty-acid amide hydrolase 1
Synonyms:
Anandamide amidohydrolase FAAH FAAH1_HUMAN Fatty-acid amide hydrolase (FAAH) Oleamide hydrolase 1
Type:
Protein
Mol. Mass.:
63071.19
Organism:
Homo sapiens (Human)
Description:
O00519
Residue:
579
  
Inhibitor
Name:
BDBM50309712
Synonyms:
4-fluorobenzaldehyde O-4-(nonyloxy)phenylcarbamoyl oxime | CHEMBL597648
Type:
Small organic molecule
Emp. Form.:
C23H29FN2O3
Mol. Mass.:
400.4864
SMILES:
CCCCCCCCCOc1ccc(NC(=O)O\N=C\c2ccc(F)cc2)cc1
: