Target
Potassium voltage-gated channel subfamily H member 2
Ligand
BDBM50309961
Substrate
Meas. Tech.
ChEMBL_612185 (CHEMBL1074123)
Ki
3760±n/a nM
Citation
 Lowe, JADeninno, SLDrozda, SESchmidt, CJWard, KMDavid Tingley, FSanner, MTunucci, DValentine, J An octahydro-cyclopenta[c]pyrrole series of inhibitors of the type 1 glycine transporter. Bioorg Med Chem Lett 20:907-11 (2010)  
Target
Name:
Potassium voltage-gated channel subfamily H member 2
Synonyms:
1,3-beta-glucan synthase component GLS2 ERG Eag-related protein 1 Ether-a-go-go-related gene (HERG) Ether-a-go-go-related gene potassium channel 1 Ether-a-go-go-related gene potassium channel 1 (hERG1) Ether-a-go-go-related protein 1 H-ERG KCNH2 Potassium voltage-gated channel subfamily H member 2 (hERG) Voltage-gated potassium channel subunit Kv11.1 hERG Potassium Channel 1 | putative potassium channel subunit
Type:
Multi-pass membrane protein
Mol. Mass.:
126672.65
Organism:
Homo sapiens (Human)
Description:
Q12809
Residue:
1159
  
Inhibitor
Name:
BDBM50309961
Synonyms:
CHEMBL3217125 | N-((cis)-4-aminocyclohexyl)-N-(3-chlorobenzyl)-1-methyl-1H-imidazole-4-carboxamide dihydrochloride
Type:
Small organic molecule
Emp. Form.:
C18H26Cl4N4O
Mol. Mass.:
456.237
SMILES:
Cl.Cl.Cl.Cn1cnc(c1)C(=O)N(Cc1cccc(Cl)c1)[C@@H]1CC[C@H](N)CC1
: