Target
Potassium voltage-gated channel subfamily H member 2
Ligand
BDBM50309960
Substrate
Meas. Tech.
ChEMBL_612185 (CHEMBL1074123)
Ki
3310±n/a nM
Citation
 Lowe, JADeninno, SLDrozda, SESchmidt, CJWard, KMDavid Tingley, FSanner, MTunucci, DValentine, J An octahydro-cyclopenta[c]pyrrole series of inhibitors of the type 1 glycine transporter. Bioorg Med Chem Lett 20:907-11 (2010)  
Target
Name:
Potassium voltage-gated channel subfamily H member 2
Synonyms:
1,3-beta-glucan synthase component GLS2 ERG Eag-related protein 1 Ether-a-go-go-related gene (HERG) Ether-a-go-go-related gene potassium channel 1 Ether-a-go-go-related gene potassium channel 1 (hERG1) Ether-a-go-go-related protein 1 H-ERG KCNH2 Potassium voltage-gated channel subfamily H member 2 (hERG) Voltage-gated potassium channel subunit Kv11.1 hERG Potassium Channel 1 | putative potassium channel subunit
Type:
Multi-pass membrane protein
Mol. Mass.:
126672.65
Organism:
Homo sapiens (Human)
Description:
Q12809
Residue:
1159
  
Inhibitor
Name:
BDBM50309960
Synonyms:
(exo)-1-Methyl-1H-imidazole-4-carboxylic acid(3-trifluoromethyl, 4-fluorobenzyl)-(octahydro-cyclopenta[c]pyrrol-5-yl)-amide | CHEMBL596699
Type:
Small organic molecule
Emp. Form.:
C20H22F4N4O
Mol. Mass.:
410.4085
SMILES:
Cn1cnc(c1)C(=O)N(Cc1ccc(F)c(c1)C(F)(F)F)[C@@H]1C[C@@H]2CNC[C@@H]2C1
: