Target
Sodium- and chloride-dependent glycine transporter 2
Ligand
BDBM50309958
Substrate
Meas. Tech.
ChEMBL_612179 (CHEMBL1073599)
IC50
2270±n/a nM
Citation
 Lowe, JADeninno, SLDrozda, SESchmidt, CJWard, KMDavid Tingley, FSanner, MTunucci, DValentine, J An octahydro-cyclopenta[c]pyrrole series of inhibitors of the type 1 glycine transporter. Bioorg Med Chem Lett 20:907-11 (2010)  
Target
Name:
Sodium- and chloride-dependent glycine transporter 2
Synonyms:
GLYT2 NET1 SLC6A5 | Sodium- and chloride-dependent glycine transporter 2
Type:
Enzyme Catalytic Domain
Mol. Mass.:
87438.56
Organism:
Homo sapiens (Human)
Description:
Glycine-2-transporter 0 HUMAN::Q9Y345
Residue:
797
  
Inhibitor
Name:
BDBM50309958
Synonyms:
(exo)-1-Methyl-1H-imidazole-4-carboxylic acid(3-cyclopentyloxy, 4-fluorobenzyl)-octahydro-cyclopenta[c]pyrrol-5-yl)-amide | CHEMBL599060
Type:
Small organic molecule
Emp. Form.:
C24H31FN4O2
Mol. Mass.:
426.5269
SMILES:
Cn1cnc(c1)C(=O)N(Cc1ccc(F)c(OC2CCCC2)c1)[C@@H]1C[C@@H]2CNC[C@@H]2C1
: