Target
Cytochrome P450 2D6
Ligand
BDBM50309970
Substrate
Meas. Tech.
ChEMBL_612187 (CHEMBL1074125)
IC50
>10000±n/a nM
Citation
 Lowe, JADeninno, SLDrozda, SESchmidt, CJWard, KMDavid Tingley, FSanner, MTunucci, DValentine, J An octahydro-cyclopenta[c]pyrrole series of inhibitors of the type 1 glycine transporter. Bioorg Med Chem Lett 20:907-11 (2010)  
Target
Name:
Cytochrome P450 2D6
Synonyms:
CP2D6_HUMAN CYP2DL1 Cytochrome P450 2D6 (CYP2D6) P450-DB1
Type:
Protein
Mol. Mass.:
55774.82
Organism:
Homo sapiens (Human)
Description:
P10635
Residue:
497
  
Inhibitor
Name:
BDBM50309970
Synonyms:
(exo)-1-Methyl-1H-imidazole-4-carboxylic acid(3-cyclopentyloxy-4-fluorobenzyl)-(2-methyl-octahydro-cyclopenta[c]pyrrol-5-yl)-amide | CHEMBL599482
Type:
Small organic molecule
Emp. Form.:
C25H33FN4O2
Mol. Mass.:
440.5535
SMILES:
CN1C[C@@H]2C[C@@H](C[C@@H]2C1)N(Cc1ccc(F)c(OC2CCCC2)c1)C(=O)c1cn(C)cn1
: