Target
Cytochrome P450 2D6
Ligand
BDBM50309963
Substrate
Meas. Tech.
ChEMBL_612187 (CHEMBL1074125)
IC50
1800±n/a nM
Citation
 Lowe, JADeninno, SLDrozda, SESchmidt, CJWard, KMDavid Tingley, FSanner, MTunucci, DValentine, J An octahydro-cyclopenta[c]pyrrole series of inhibitors of the type 1 glycine transporter. Bioorg Med Chem Lett 20:907-11 (2010)  
Target
Name:
Cytochrome P450 2D6
Synonyms:
CP2D6_HUMAN CYP2DL1 Cytochrome P450 2D6 (CYP2D6) P450-DB1
Type:
Protein
Mol. Mass.:
55774.82
Organism:
Homo sapiens (Human)
Description:
P10635
Residue:
497
  
Inhibitor
Name:
BDBM50309963
Synonyms:
(exo)-N-(2-ethyloctahydrocyclopenta[c]pyrrol-5-yl)-N-(4-fluoro-3-(trifluoromethyl)benzyl)-1-methyl-1H-imidazole-4-carboxamide | CHEMBL599480
Type:
Small organic molecule
Emp. Form.:
C22H26F4N4O
Mol. Mass.:
438.4617
SMILES:
CCN1C[C@@H]2C[C@@H](C[C@@H]2C1)N(Cc1ccc(F)c(c1)C(F)(F)F)C(=O)c1cn(C)cn1
: