Target
Cytochrome P450 3A4
Ligand
BDBM50309968
Substrate
Meas. Tech.
ChEMBL_612188 (CHEMBL1074126)
IC50
7900±n/a nM
Citation
 Lowe, JADeninno, SLDrozda, SESchmidt, CJWard, KMDavid Tingley, FSanner, MTunucci, DValentine, J An octahydro-cyclopenta[c]pyrrole series of inhibitors of the type 1 glycine transporter. Bioorg Med Chem Lett 20:907-11 (2010)  
Target
Name:
Cytochrome P450 3A4
Synonyms:
Albendazole monooxygenase CP3A4_HUMAN CYP3A4 CYPIIIA4 Cytochrome P450 3A4 (CYP3A4) Nifedipine oxidase Taurochenodeoxycholate 6-alpha-hydroxylase
Type:
Enzyme
Mol. Mass.:
57349.57
Organism:
Homo sapiens (Human)
Description:
Residue:
503
  
Inhibitor
Name:
BDBM50309968
Synonyms:
(exo)-N-(2-(2-fluoropropyl)octahydrocyclopenta[c]pyrrol-5-yl)-1-methyl-N-(3-(trifluoromethoxy)benzyl)-1H-imidazole-4-carboxamide | CHEMBL605540
Type:
Small organic molecule
Emp. Form.:
C23H28F4N4O2
Mol. Mass.:
468.4876
SMILES:
CC(F)CN1C[C@@H]2C[C@@H](C[C@@H]2C1)N(Cc1cccc(OC(F)(F)F)c1)C(=O)c1cn(C)cn1
: