Target
Furin
Ligand
BDBM50310148
Substrate
Meas. Tech.
ChEMBL_612742 (CHEMBL1070206)
IC50
>50000±n/a nM
Citation
 De, SKChen, VStebbins, JLChen, LHCellitti, JFMachleidt, TBarile, ERiel-Mehan, MDahl, RYang, LEmdadi, AMurphy, RPellecchia, M Synthesis and optimization of thiadiazole derivatives as a novel class of substrate competitive c-Jun N-terminal kinase inhibitors. Bioorg Med Chem 18:590-6 (2010)  
Target
Name:
Furin
Synonyms:
FUR FURIN_HUMAN PACE | PCSK3
Type:
Enzyme Catalytic Domain
Mol. Mass.:
86676.01
Organism:
Homo sapiens (Human)
Description:
P09958
Residue:
794
  
Inhibitor
Name:
BDBM50310148
Synonyms:
BI-90H9 N-(2-Methoxyethyl)-5-(5-nitrothiazol-2-ylthio)-1,3,4-thiadiazol-2-amine
Type:
Small organic molecule
Emp. Form.:
C8H9N5O3S3
Mol. Mass.:
319.384
SMILES:
COCCNc1nnc(Sc2ncc(s2)[N+]([O-])=O)s1
: