Target
cAMP-specific 3',5'-cyclic phosphodiesterase 4D
Ligand
BDBM50310250
Substrate
Meas. Tech.
ChEMBL_607913 (CHEMBL1066241)
IC50
67±n/a nM
Citation
 Kim, ISong, JHPark, CMJeong, JWKim, HRHa, JRNo, ZHyun, YLCho, YSSook Kang, NJeon, DJ Design, synthesis, and evaluation of 2-aryl-7-(3',4'-dialkoxyphenyl)-pyrazolo[1,5-a]pyrimidines as novel PDE-4 inhibitors. Bioorg Med Chem Lett 20:922-6 (2010)  
Target
Name:
cAMP-specific 3',5'-cyclic phosphodiesterase 4D
Synonyms:
3',5'-cyclic phosphodiesterase PDE43 PDE4D_HUMAN | Phosphodiesterase 4D
Type:
Protein
Mol. Mass.:
91092.69
Organism:
Homo sapiens (Human)
Description:
Q08499
Residue:
809
  
Inhibitor
Name:
BDBM50310250
Synonyms:
3-[7-(3'-Cyclopropylmethoxy-4'-difluoromethoxyphenyl)-pyrazolo[1,5-a]pyrimidin-2-yl]-N,N-diethylbenzamide | CHEMBL599525
Type:
Small organic molecule
Emp. Form.:
C28H28F2N4O3
Mol. Mass.:
506.5437
SMILES:
CCN(CC)C(=O)c1cccc(c1)-c1cc2nccc(-c3ccc(OC(F)F)c(OCC4CC4)c3)n2n1
: