Target
Estrogen receptor
Ligand
BDBM50310424
Substrate
Meas. Tech.
ChEMBL_622102 (CHEMBL1114101)
IC50
1736±n/a nM
Citation
 Jain, NXu, JKanojia, RMDu, FJian-Zhong, GPacia, ELai, MTMusto, AAllan, GReuman, MLi, XHahn, DCousineau, MPeng, SRitchie, DRussell, RLundeen, SSui, Z Identification and structure-activity relationships of chromene-derived selective estrogen receptor modulators for treatment of postmenopausal symptoms. J Med Chem 52:7544-69 (2009)  
Target
Name:
Estrogen receptor
Synonyms:
ER ESR ESR1_HUMAN Estrogen receptor Estrogen receptor (ER-alpha) Estrogen receptor alpha (ER) Nuclear receptor subfamily 3 group A member 1
Type:
Protein
Mol. Mass.:
66230.44
Organism:
Homo sapiens (Human)
Description:
P03372
Residue:
595
  
Inhibitor
Name:
BDBM50310424
Synonyms:
1-{2-[4-((R)-2,8-Dimethoxy-11,12-dihydro-5H-6,13-dioxa-benzo[3,4]cyclohepta[1,2-a]naphthalen-5-yl)-phenoxy]-ethyl}-piperidine JNJ-19398990
Type:
Small organic molecule
Emp. Form.:
C32H35NO5
Mol. Mass.:
513.624
SMILES:
COc1ccc2C3=C([C@H](Oc2c1)c1ccc(OCCN2CCCCC2)cc1)c1ccc(OC)cc1OCC3
: