Target
Ribosomal protein S6 kinase beta-1
Ligand
BDBM50310467
Substrate
Meas. Tech.
ChEMBL_619398 (CHEMBL1104156)
Ki
1900±n/a nM
Citation
 Bandarage, UHare, BParsons, JPham, LMarhefka, CBemis, GTang, QMoody, CSRodems, SShah, SAdams, CBravo, JCharonnet, ESavic, VCome, JHGreen, J 4-(Benzimidazol-2-yl)-1,2,5-oxadiazol-3-ylamine derivatives: potent and selective p70S6 kinase inhibitors. Bioorg Med Chem Lett 19:5191-4 (2009)  
Target
Name:
Ribosomal protein S6 kinase beta-1
Synonyms:
70 kDa ribosomal protein S6 kinase 1 70 kDa ribosomal protein kinase (p70S6K) Protein kinase 70S6K (T412E) RPS6KB1 Ribosomal protein S6 kinase I STK14A p70S6K1
Type:
Enzyme
Mol. Mass.:
59139.89
Organism:
Homo sapiens (Human)
Description:
His-tagged S6K1.
Residue:
525
  
Inhibitor
Name:
BDBM50310467
Synonyms:
4-(1-(3-methoxyphenyl)-1H-benzo[d]imidazol-2-yl)-1,2,5-oxadiazol-3-amine | CHEMBL1078155
Type:
Small organic molecule
Emp. Form.:
C16H13N5O2
Mol. Mass.:
307.3067
SMILES:
COc1cccc(c1)-n1c(nc2ccccc12)-c1nonc1N
: