Target
Seminal ribonuclease
Ligand
BDBM50233301
Substrate
Meas. Tech.
ChEMBL_620093 (CHEMBL1109348)
pH
6±n/a
Ki
27900±n/a nM
Comments
extracted
Citation
 Dossi, KTsirkone, VGHayes, JMMatousek, JPoucková, PSoucek, JZadinova, MZographos, SELeonidas, DD Mapping the ribonucleolytic active site of bovine seminal ribonuclease. The binding of pyrimidinyl phosphonucleotide inhibitors. Eur J Med Chem 44:4496-508 (2009)  
Target
Name:
Seminal ribonuclease
Synonyms:
RNS_BOVIN | SRN
Type:
PROTEIN
Mol. Mass.:
16390.13
Organism:
Bos taurus
Description:
ChEMBL_620093
Residue:
150
  
Inhibitor
Name:
BDBM50233301
Synonyms:
CHEMBL258728 | cytidine-3'-monophosphate
Type:
Small organic molecule
Emp. Form.:
C9H14N3O8P
Mol. Mass.:
323.1965
SMILES:
Nc1ccn([C@@H]2O[C@H](CO)[C@@H](OP(O)(O)=O)[C@H]2O)c(=O)n1
: